[INFO] ------------------------------------------------------------------------
[INFO] BUILD FAILURE
[INFO] ------------------------------------------------------------------------
[INFO] Total time:  2.730 s
[INFO] Finished at: 2024-10-22T22:56:07+02:00
[INFO] ------------------------------------------------------------------------
[ERROR] Failed to execute goal org.apache.maven.plugins:maven-jar-plugin:3.3.0:jar (default-jar) on project plexus-archiver: Execution default-jar of goal org.apache.maven.plugins:maven-jar-plugin:3.3.0:jar failed: Cannot invoke "org.codehaus.plexus.archiver.jar.JarArchiver.configureReproducibleBuild(java.nio.file.attribute.FileTime)" because the return value of "org.apache.maven.archiver.MavenArchiver.getArchiver()" is null -> [Help 1]
[ERROR]
